{"text_format":"1","workbook":"xlsx","n_sheets":6,"sheets":["Instructions","Inputs-Inv","Inputs-Oper","Cash Flow","PartnershipCF","8YRDCF"],"not_rendered":{"charts":0,"images":0,"macros":1,"external_links":0,"defined_names":111,"comments":4,"pivot_tables":0},"unopened":[],"bounds":{"document_bytes":16777216,"sheet_cells":100000,"rows_first":2000,"rows_last":500,"rows_between":2000,"halvings":0,"cell_chars":16384,"cell_head_chars":4096},"cells_cut":0,"cells_raw":0,"read":"whole","date_system":"1900"}

{"sheet":"Instructions","index":0,"n_rows":35,"n_cols":2,"rows_kept":35,"cut":false,"hidden":false,"merged":[[0,0,0,7],[1,0,1,7],[2,0,2,7],[3,0,3,7]]}
["INVESTMENT MODEL INSTRUCTIONS"]
["TEST APARTMENT MODEL"]
["Fred Mertz Apartments"]
["555 Main Street"]
["Erehwon, WI"]
[]
["Color Codes"]
["Green","User Input Fields"]
["Blue","Calculated Field -- User can overide as desired"]
["Tan","Constant that rarely changes (e.g. tax rates)"]
{"$rows_left_out":26}
{"sheet":"Inputs-Inv","index":1,"n_rows":50,"n_cols":7,"rows_kept":50,"cut":false,"hidden":false,"merged":[[0,0,0,7],[1,0,1,7],[2,0,2,7],[3,0,3,7]]}
["INVESTMENT MODEL INPUTS"]
["APARTMENT INVESTMENT"]
["Merz Apartments"]
["555 Main Street"]
[]
["INVESTMENT INFORMATION",null,null,null,"BUILDING INFORMATION"]
["Overall Investment",null,null,null,"Building Name:","PropName","Mertz Apartments"]
["Asking Price:","ASKPRICE",6000000,null,"Address:","PropAddr","555 Main Street"]
[]
["Purchase Price:","PURPRICE",5950000]
{"$rows_left_out":41}
{"sheet":"Inputs-Oper","index":2,"n_rows":59,"n_cols":28,"rows_kept":59,"cut":false,"hidden":false,"merged":[[0,0,0,17],[1,0,1,17],[2,0,2,17],[3,0,3,17]]}
["PRO FORMA OPERATING ASSUMPTIONS"]
["APARTMENT INVESTMENT"]
["Merz Apartments"]
["555 Main Street"]
[]
["RENTAL INCOME ASSUMPTIONS"]
[null,null,null,null,null,null,"Monthly Rent",null,"GROWTH RATE ASSUMPTIONS"]
[null,null,"Unit Type","MNEM","# Units",null,"Year 1",null,"Stabilized","Year 2","Year 3","Year 4","Year 5","Year 6","Year 7","Year 8","Year 9","Year 10","Year 11","Year 12","Year 13","Year 14","Year 15","Year 16","Year 17","Year 18","Year 19","Year 20"]
[null,"T1","Efficiency","QTYT1",15,"RENTT1",700,null,0.04]
[null,"T2","1BR1BA","QTYT2",25,"RENTT2",750,null,{"$f":"$I$9","v":0.04}]
{"$rows_left_out":50}
{"sheet":"Cash Flow","index":3,"n_rows":172,"n_cols":33,"rows_kept":172,"cut":false,"hidden":false,"merged":[[0,0,0,12],[1,0,1,12]]}
[{"$f":"PropName&\" Operating Projections\"","v":"Mertz Apartments Operating Projections"}]
[{"$f":"PropAddr","v":"555 Main Street"}]
[]
[null,null,null,"Year 1","Year 2","Year 3","Year 4","Year 5","Year 6","Year 7","Year 8","Year 9","Year 10","Year 11","Year 12","Year 13","Year 14","Year 15","Year 16","Year 17","Year 18","Year 19","Year 20","Year 21"]
["GROSS POTENTIAL INCOME"]
["Rental Income"]
[null,{"$f":"T1_","v":"Efficiency"},null,{"$f":"RENTT1*QTYT1*12","v":126000},{"$f":"D7*(1+(IF(ISBLANK('Inputs-Oper'!J9),'Inputs-Oper'!$I9,'Inputs-Oper'!J9)))","v":131040},{"$f":"E7*(1+(IF(ISBLANK('Inputs-Oper'!K9),'Inputs-Oper'!$I9,'Inputs-Oper'!K9)))","v":136281.60000000001},{"$f":"F7*(1+(IF(ISBLANK('Inputs-Oper'!L9),'Inputs-Oper'!$I9,'Inputs-Oper'!L9)))","v":141732.864},{"$f":"G7*(1+(IF(ISBLANK('Inputs-Oper'!M9),'Inputs-Oper'!$I9,'Inputs-Oper'!M9)))","v":147402.17856},{"$f":"H7*(1+(IF(ISBLANK('Inputs-Oper'!N9),'Inputs-Oper'!$I9,'Inputs-Oper'!N9)))","v":153298.26570240001},{"$f":"I7*(1+(IF(ISBLANK('Inputs-Oper'!O9),'Inputs-Oper'!$I9,'Inputs-Oper'!O9)))","v":159430.19633049602},{"$f":"J7*(1+(IF(ISBLANK('Inputs-Oper'!P9),'Inputs-Oper'!$I9,'Inputs-Oper'!P9)))","v":165807.40418371587},{"$f":"K7*(1+(IF(ISBLANK('Inputs-Oper'!Q9),'Inputs-Oper'!$I9,'Inputs-Oper'!Q9)))","v":172439.7003510645},{"$f":"L7*(1+(IF(ISBLANK('Inputs-Oper'!R9),'Inputs-Oper'!$I9,'Inputs-Oper'!R9)))","v":179337.28836510709},{"$f":"M7*(1+(IF(ISBLANK('Inputs-Oper'!S9),'Inputs-Oper'!$I9,'Inputs-Oper'!S9)))","v":186510.77989971137},{"$f":"N7*(1+(IF(ISBLANK('Inputs-Oper'!T9),'Inputs-Oper'!$I9,'Inputs-Oper'!T9)))","v":193971.21109569984},{"$f":"O7*(1+(IF(ISBLANK('Inputs-Oper'!U9),'Inputs-Oper'!$I9,'Inputs-Oper'!U9)))","v":201730.05953952784},{"$f":"P7*(1+(IF(ISBLANK('Inputs-Oper'!V9),'Inputs-Oper'!$I9,'Inputs-Oper'!V9)))","v":209799.26192110896},{"$f":"Q7*(1+(IF(ISBLANK('Inputs-Oper'!W9),'Inputs-Oper'!$I9,'Inputs-Oper'!W9)))","v":218191.23239795334},{"$f":"R7*(1+(IF(ISBLANK('Inputs-Oper'!X9),'Inputs-Oper'!$I9,'Inputs-Oper'!X9)))","v":226918.88169387149},{"$f":"S7*(1+(IF(ISBLANK('Inputs-Oper'!Y9),'Inputs-Oper'!$I9,'Inputs-Oper'!Y9)))","v":235995.63696162635},{"$f":"T7*(1+(IF(ISBLANK('Inputs-Oper'!Z9),'Inputs-Oper'!$I9,'Inputs-Oper'!Z9)))","v":245435.46244009142},{"$f":"U7*(1+(IF(ISBLANK('Inputs-Oper'!AA9),'Inputs-Oper'!$I9,'Inputs-Oper'!AA9)))","v":255252.8809376951},{"$f":"V7*(1+(IF(ISBLANK('Inputs-Oper'!AB9),'Inputs-Oper'!$I9,'Inputs-Oper'!AB9)))","v":265462.99617520289},{"$f":"W7*(1+(IF(ISBLANK('Inputs-Oper'!AC9),'Inputs-Oper'!$I9,'Inputs-Oper'!AC9)))","v":276081.516022211}]
[null,{"$f":"T2_","v":"1BR1BA"},null,{"$f":"RENTT2*QTYT2*12","v":225000},{"$f":"D8*(1+(IF(ISBLANK('Inputs-Oper'!J10),'Inputs-Oper'!$I10,'Inputs-Oper'!J10)))","v":234000},{"$f":"E8*(1+(IF(ISBLANK('Inputs-Oper'!K10),'Inputs-Oper'!$I10,'Inputs-Oper'!K10)))","v":243360},{"$f":"F8*(1+(IF(ISBLANK('Inputs-Oper'!L10),'Inputs-Oper'!$I10,'Inputs-Oper'!L10)))","v":253094.39999999999},{"$f":"G8*(1+(IF(ISBLANK('Inputs-Oper'!M10),'Inputs-Oper'!$I10,'Inputs-Oper'!M10)))","v":263218.17599999998},{"$f":"H8*(1+(IF(ISBLANK('Inputs-Oper'!N10),'Inputs-Oper'!$I10,'Inputs-Oper'!N10)))","v":273746.90304},{"$f":"I8*(1+(IF(ISBLANK('Inputs-Oper'!O10),'Inputs-Oper'!$I10,'Inputs-Oper'!O10)))","v":284696.77916159999},{"$f":"J8*(1+(IF(ISBLANK('Inputs-Oper'!P10),'Inputs-Oper'!$I10,'Inputs-Oper'!P10)))","v":296084.65032806399},{"$f":"K8*(1+(IF(ISBLANK('Inputs-Oper'!Q10),'Inputs-Oper'!$I10,'Inputs-Oper'!Q10)))","v":307928.03634118655},{"$f":"L8*(1+(IF(ISBLANK('Inputs-Oper'!R10),'Inputs-Oper'!$I10,'Inputs-Oper'!R10)))","v":320245.15779483406},{"$f":"M8*(1+(IF(ISBLANK('Inputs-Oper'!S10),'Inputs-Oper'!$I10,'Inputs-Oper'!S10)))","v":333054.96410662745},{"$f":"N8*(1+(IF(ISBLANK('Inputs-Oper'!T10),'Inputs-Oper'!$I10,'Inputs-Oper'!T10)))","v":346377.16267089255},{"$f":"O8*(1+(IF(ISBLANK('Inputs-Oper'!U10),'Inputs-Oper'!$I10,'Inputs-Oper'!U10)))","v":360232.24917772826},{"$f":"P8*(1+(IF(ISBLANK('Inputs-Oper'!V10),'Inputs-Oper'!$I10,'Inputs-Oper'!V10)))","v":374641.53914483741},{"$f":"Q8*(1+(IF(ISBLANK('Inputs-Oper'!W10),'Inputs-Oper'!$I10,'Inputs-Oper'!W10)))","v":389627.20071063092},{"$f":"R8*(1+(IF(ISBLANK('Inputs-Oper'!X10),'Inputs-Oper'!$I10,'Inputs-Oper'!X10)))","v":405212.28873905615},{"$f":"S8*(1+(IF(ISBLANK('Inputs-Oper'!Y10),'Inputs-Oper'!$I10,'Inputs-Oper'!Y10)))","v":421420.78028861841},{"$f":"T8*(1+(IF(ISBLANK('Inputs-Oper'!Z10),'Inputs-Oper'!$I10,'Inputs-Oper'!Z10)))","v":438277.61150016316},{"$f":"U8*(1+(IF(ISBLANK('Inputs-Oper'!AA10),'Inputs-Oper'!$I10,'Inputs-Oper'!AA10)))","v":455808.71596016968},{"$f":"V8*(1+(IF(ISBLANK('Inputs-Oper'!AB10),'Inputs-Oper'!$I10,'Inputs-Oper'!AB10)))","v":474041.06459857646},{"$f":"W8*(1+(IF(ISBLANK('Inputs-Oper'!AC10),'Inputs-Oper'!$I10,'Inputs-Oper'!AC10)))","v":493002.70718251955}]
[null,{"$f":"T3_","v":"2BR1BA"},null,{"$f":"RENTT3*QTYT3*12","v":240000},{"$f":"D9*(1+(IF(ISBLANK('Inputs-Oper'!J11),'Inputs-Oper'!$I11,'Inputs-Oper'!J11)))","v":249600},{"$f":"E9*(1+(IF(ISBLANK('Inputs-Oper'!K11),'Inputs-Oper'!$I11,'Inputs-Oper'!K11)))","v":259584},{"$f":"F9*(1+(IF(ISBLANK('Inputs-Oper'!L11),'Inputs-Oper'!$I11,'Inputs-Oper'!L11)))","v":269967.35999999999},{"$f":"G9*(1+(IF(ISBLANK('Inputs-Oper'!M11),'Inputs-Oper'!$I11,'Inputs-Oper'!M11)))","v":280766.05440000002},{"$f":"H9*(1+(IF(ISBLANK('Inputs-Oper'!N11),'Inputs-Oper'!$I11,'Inputs-Oper'!N11)))","v":291996.69657600002},{"$f":"I9*(1+(IF(ISBLANK('Inputs-Oper'!O11),'Inputs-Oper'!$I11,'Inputs-Oper'!O11)))","v":303676.56443904003},{"$f":"J9*(1+(IF(ISBLANK('Inputs-Oper'!P11),'Inputs-Oper'!$I11,'Inputs-Oper'!P11)))","v":315823.62701660162},{"$f":"K9*(1+(IF(ISBLANK('Inputs-Oper'!Q11),'Inputs-Oper'!$I11,'Inputs-Oper'!Q11)))","v":328456.57209726569},{"$f":"L9*(1+(IF(ISBLANK('Inputs-Oper'!R11),'Inputs-Oper'!$I11,'Inputs-Oper'!R11)))","v":341594.83498115634},{"$f":"M9*(1+(IF(ISBLANK('Inputs-Oper'!S11),'Inputs-Oper'!$I11,'Inputs-Oper'!S11)))","v":355258.62838040263},{"$f":"N9*(1+(IF(ISBLANK('Inputs-Oper'!T11),'Inputs-Oper'!$I11,'Inputs-Oper'!T11)))","v":369468.97351561877},{"$f":"O9*(1+(IF(ISBLANK('Inputs-Oper'!U11),'Inputs-Oper'!$I11,'Inputs-Oper'!U11)))","v":384247.73245624354},{"$f":"P9*(1+(IF(ISBLANK('Inputs-Oper'!V11),'Inputs-Oper'!$I11,'Inputs-Oper'!V11)))","v":399617.64175449329},{"$f":"Q9*(1+(IF(ISBLANK('Inputs-Oper'!W11),'Inputs-Oper'!$I11,'Inputs-Oper'!W11)))","v":415602.34742467303},{"$f":"R9*(1+(IF(ISBLANK('Inputs-Oper'!X11),'Inputs-Oper'!$I11,'Inputs-Oper'!X11)))","v":432226.44132165995},{"$f":"S9*(1+(IF(ISBLANK('Inputs-Oper'!Y11),'Inputs-Oper'!$I11,'Inputs-Oper'!Y11)))","v":449515.49897452636},{"$f":"T9*(1+(IF(ISBLANK('Inputs-Oper'!Z11),'Inputs-Oper'!$I11,'Inputs-Oper'!Z11)))","v":467496.11893350742},{"$f":"U9*(1+(IF(ISBLANK('Inputs-Oper'!AA11),'Inputs-Oper'!$I11,'Inputs-Oper'!AA11)))","v":486195.96369084774},{"$f":"V9*(1+(IF(ISBLANK('Inputs-Oper'!AB11),'Inputs-Oper'!$I11,'Inputs-Oper'!AB11)))","v":505643.80223848164},{"$f":"W9*(1+(IF(ISBLANK('Inputs-Oper'!AC11),'Inputs-Oper'!$I11,'Inputs-Oper'!AC11)))","v":525869.55432802089}]
[null,{"$f":"T4_","v":"2BR2BA"},null,{"$f":"RENTT4*QTYT4*12","v":148500},{"$f":"D10*(1+(IF(ISBLANK('Inputs-Oper'!J12),'Inputs-Oper'!$I12,'Inputs-Oper'!J12)))","v":154440},{"$f":"E10*(1+(IF(ISBLANK('Inputs-Oper'!K12),'Inputs-Oper'!$I12,'Inputs-Oper'!K12)))","v":160617.60000000001},{"$f":"F10*(1+(IF(ISBLANK('Inputs-Oper'!L12),'Inputs-Oper'!$I12,'Inputs-Oper'!L12)))","v":167042.304},{"$f":"G10*(1+(IF(ISBLANK('Inputs-Oper'!M12),'Inputs-Oper'!$I12,'Inputs-Oper'!M12)))","v":173723.99616000001},{"$f":"H10*(1+(IF(ISBLANK('Inputs-Oper'!N12),'Inputs-Oper'!$I12,'Inputs-Oper'!N12)))","v":180672.95600640003},{"$f":"I10*(1+(IF(ISBLANK('Inputs-Oper'!O12),'Inputs-Oper'!$I12,'Inputs-Oper'!O12)))","v":187899.87424665602},{"$f":"J10*(1+(IF(ISBLANK('Inputs-Oper'!P12),'Inputs-Oper'!$I12,'Inputs-Oper'!P12)))","v":195415.86921652226},{"$f":"K10*(1+(IF(ISBLANK('Inputs-Oper'!Q12),'Inputs-Oper'!$I12,'Inputs-Oper'!Q12)))","v":203232.50398518317},{"$f":"L10*(1+(IF(ISBLANK('Inputs-Oper'!R12),'Inputs-Oper'!$I12,'Inputs-Oper'!R12)))","v":211361.80414459051},{"$f":"M10*(1+(IF(ISBLANK('Inputs-Oper'!S12),'Inputs-Oper'!$I12,'Inputs-Oper'!S12)))","v":219816.27631037415},{"$f":"N10*(1+(IF(ISBLANK('Inputs-Oper'!T12),'Inputs-Oper'!$I12,'Inputs-Oper'!T12)))","v":228608.92736278911},{"$f":"O10*(1+(IF(ISBLANK('Inputs-Oper'!U12),'Inputs-Oper'!$I12,'Inputs-Oper'!U12)))","v":237753.28445730067},{"$f":"P10*(1+(IF(ISBLANK('Inputs-Oper'!V12),'Inputs-Oper'!$I12,'Inputs-Oper'!V12)))","v":247263.41583559272},{"$f":"Q10*(1+(IF(ISBLANK('Inputs-Oper'!W12),'Inputs-Oper'!$I12,'Inputs-Oper'!W12)))","v":257153.95246901643},{"$f":"R10*(1+(IF(ISBLANK('Inputs-Oper'!X12),'Inputs-Oper'!$I12,'Inputs-Oper'!X12)))","v":267440.11056777707},{"$f":"S10*(1+(IF(ISBLANK('Inputs-Oper'!Y12),'Inputs-Oper'!$I12,'Inputs-Oper'!Y12)))","v":278137.71499048814},{"$f":"T10*(1+(IF(ISBLANK('Inputs-Oper'!Z12),'Inputs-Oper'!$I12,'Inputs-Oper'!Z12)))","v":289263.22359010769},{"$f":"U10*(1+(IF(ISBLANK('Inputs-Oper'!AA12),'Inputs-Oper'!$I12,'Inputs-Oper'!AA12)))","v":300833.75253371202},{"$f":"V10*(1+(IF(ISBLANK('Inputs-Oper'!AB12),'Inputs-Oper'!$I12,'Inputs-Oper'!AB12)))","v":312867.1026350605},{"$f":"W10*(1+(IF(ISBLANK('Inputs-Oper'!AC12),'Inputs-Oper'!$I12,'Inputs-Oper'!AC12)))","v":325381.78674046294}]
{"$rows_left_out":163}
{"sheet":"PartnershipCF","index":4,"n_rows":87,"n_cols":22,"rows_kept":87,"cut":false,"hidden":false,"merged":[[0,0,0,9],[1,0,1,9],[2,0,2,9],[3,0,3,9]]}
["PARTNERSHIP CASH FLOWS"]
["APARTMENT INVESTMENT"]
[{"$f":"PropName","v":"Mertz Apartments"}]
[{"$f":"PropAddr","v":"555 Main Street"}]
[]
["OVERALL PROPERTY CASH FLOWS"]
[null,"Year 1","Year 2","Year 3","Year 4","Year 5","Year 6","Year 7","Year 8","Year 9","Year 10","Year 11","Year 12","Year 13","Year 14","Year 15","Year 16","Year 17","Year 18","Year 19","Year 20","Year 21"]
["BTCF",{"$f":"'Cash Flow'!D69","v":-61320.161679165423},{"$f":"'Cash Flow'!E69","v":-45381.961679165412},{"$f":"'Cash Flow'!F69","v":-28806.233679165525},{"$f":"'Cash Flow'!G69","v":-11567.476559165501},{"$f":"'Cash Flow'!H69","v":6360.8308456344676},{"$f":"'Cash Flow'!I69","v":25006.270546626663},{"$f":"'Cash Flow'!J69","v":44397.527835658359},{"$f":"'Cash Flow'!K69","v":64564.435416251188},{"$f":"'Cash Flow'!L69","v":85538.01930006803},{"$f":"'Cash Flow'!M69","v":107350.54653923726},{"$f":"'Cash Flow'!N69","v":130035.57486797334},{"$f":"'Cash Flow'!O69","v":153628.00432985905},{"$f":"'Cash Flow'!P69","v":178164.13097022008},{"$f":"'Cash Flow'!Q69","v":203681.70267619524},{"$f":"'Cash Flow'!R69","v":230219.97725041007},{"$f":"'Cash Flow'!S69","v":257819.78280759294},{"$f":"'Cash Flow'!T69","v":286523.58058706328},{"$f":"'Cash Flow'!U69","v":316375.53027771221},{"$f":"'Cash Flow'!V69","v":347421.55795598717},{"$f":"'Cash Flow'!W69","v":379709.42674139352},{"$f":"'Cash Flow'!X69","v":413288.81027821603}]
["Taxable Income",{"$f":"'Cash Flow'!D66","v":-143861.93852250843},{"$f":"'Cash Flow'!E66","v":-124450.19515249901},{"$f":"'Cash Flow'!F66","v":-104103.2684225128},{"$f":"'Cash Flow'!G66","v":-82770.150488196581},{"$f":"'Cash Flow'!H66","v":-60396.627734619251},{"$f":"'Cash Flow'!I66","v":-36925.052674988925},{"$f":"'Cash Flow'!J66","v":-12294.098167167511},{"$f":"'Cash Flow'!K66","v":13561.507492613688},{"$f":"'Cash Flow'!L66","v":40711.266159984458},{"$f":"'Cash Flow'!M66","v":69229.21780840162},{"$f":"'Cash Flow'!N66","v":99194.272704366769},{"$f":"'Cash Flow'!O66","v":130690.56977923558},{"$f":"'Cash Flow'!P66","v":163807.86335170449},{"$f":"'Cash Flow'!Q66","v":198641.94053605059},{"$f":"'Cash Flow'!R66","v":235295.07186754351},{"$f":"'Cash Flow'!S66","v":273876.49788936798},{"$f":"'Cash Flow'!T66","v":314502.95467660413},{"$f":"'Cash Flow'!U66","v":357299.24152342963},{"$f":"'Cash Flow'!V66","v":402398.83429180807},{"$f":"'Cash Flow'!W66","v":449944.54821512115},{"$f":"'Cash Flow'!X66","v":500089.25427044742}]
[]
{"$rows_left_out":78}
{"sheet":"8YRDCF","index":5,"n_rows":58,"n_cols":12,"rows_kept":58,"cut":false,"hidden":false,"merged":[[0,0,0,11],[1,0,1,11],[2,0,2,11],[3,0,3,11]]}
["8-YEAR PRO FORMA"]
["APARTMENT INVESTMENT"]
[{"$f":"PropName","v":"Mertz Apartments"}]
[{"$f":"PropAddr","v":"555 Main Street"}]
[]
[null,null,null,{"$f":"'Cash Flow'!D4","v":"Year 1"},{"$f":"'Cash Flow'!E4","v":"Year 2"},{"$f":"'Cash Flow'!F4","v":"Year 3"},{"$f":"'Cash Flow'!G4","v":"Year 4"},{"$f":"'Cash Flow'!H4","v":"Year 5"},{"$f":"'Cash Flow'!I4","v":"Year 6"},{"$f":"'Cash Flow'!J4","v":"Year 7"},{"$f":"'Cash Flow'!K4","v":"Year 8"},{"$f":"'Cash Flow'!L4","v":"Year 9"}]
[{"$f":"'Cash Flow'!A5","v":"GROSS POTENTIAL INCOME"}]
[{"$f":"'Cash Flow'!A16","v":"Potential Rental Income"},null,null,{"$f":"'Cash Flow'!D16","v":739500},{"$f":"'Cash Flow'!E16","v":769080},{"$f":"'Cash Flow'!F16","v":799843.2},{"$f":"'Cash Flow'!G16","v":831836.92799999996},{"$f":"'Cash Flow'!H16","v":865110.40512000001},{"$f":"'Cash Flow'!I16","v":899714.82132480014},{"$f":"'Cash Flow'!J16","v":935703.41417779215},{"$f":"'Cash Flow'!K16","v":973131.55074490374},{"$f":"'Cash Flow'!L16","v":1012056.8127747}]
[{"$f":"'Cash Flow'!A18","v":"Other Income"},null,null,{"$f":"'Cash Flow'!D23","v":1000},{"$f":"'Cash Flow'!E23","v":1040},{"$f":"'Cash Flow'!F23","v":1081.6000000000001},{"$f":"'Cash Flow'!G23","v":1124.8640000000003},{"$f":"'Cash Flow'!H23","v":1169.8585600000004},{"$f":"'Cash Flow'!I23","v":1216.6529024000004},{"$f":"'Cash Flow'!J23","v":1265.3190184960004},{"$f":"'Cash Flow'!K23","v":1315.9317792358404},{"$f":"'Cash Flow'!L23","v":1368.5690504052741}]
[{"$f":"'Cash Flow'!A25","v":"Potential Gross Income"},null,null,{"$f":"'Cash Flow'!D25","v":740500},{"$f":"'Cash Flow'!E25","v":770120},{"$f":"'Cash Flow'!F25","v":800924.79999999993},{"$f":"'Cash Flow'!G25","v":832961.7919999999},{"$f":"'Cash Flow'!H25","v":866280.26367999997},{"$f":"'Cash Flow'!I25","v":900931.47422720015},{"$f":"'Cash Flow'!J25","v":936968.73319628811},{"$f":"'Cash Flow'!K25","v":974447.48252413957},{"$f":"'Cash Flow'!L25","v":1013425.3818251053}]
{"$rows_left_out":48}